"ID","Page","Forename","Surname","AgeYrs","AgeMths","Father","Mother","AddrNo","AddrStreet1","AddrStreet2","AddrPlace1","AddrPlace2","OccFather","OccMother","MarriageDate","MarriagePlace","Children","Vaccinated","PrevDiseases","Recommended","DayAdmit","MonthAdmit","YearAdmit","Remarks","Comments"
1,"01","Ellen","Evans","0","5","Henry Evans","Ellen Evans","10","Drake Street","Red Lion Square",,,"Tailor","Charwoman","30 January 1864","St Georges Bloomsbury","Charles, Henry","No","None",,"15","March","1859","Removed to 49 Gloucester St, Queens Square",
2,"02","Louisa","Borrow","0","4","William G Borrow","Emma Borrow","10","Drake Street","Red Lion Square",,,"Hair preparer","Hair worker","15 April 1855","St Mary's Lambeth","Emma","No","None",,"17","March","1859",,
3,"03","John","Bishop","1","4","John Bishop","Charlotte Bishop","8","Britannia St","Grays Inn Road","Kings Cross",,"Tailor",,"22 October 1837","St Pauls Exeter","Georginia, Emily, Louisa, Susan, Harriet, William","Yes","None",,"23","March","1859",,
4,"04","George","Stollard","0","7","Geore Stollard","Elizth. Stolland","15","Southampton Street","Euston Sq",,,"Soldier","Dress maker",,"St Martins in the Fields",,"Yes",,,"4","April","1859",,
5,"05","Eliza","Ireland","1","0","Samuel Ireland","Eliza Ireland","11","Harrison Street","Grays Inn Rd",,,"Grocer",,"27 Feb 1853","St Pancras in the Parish of St Pancras","Edward","Yes",,"L. Larristner,11 Harrison St, Grays Inn Rd","16","April","1859",,
6,"06","Ellen","Casey","4","0","George Casey","Cathrine Casey","46","York Street",,"St Lukes",,"Watch maker",,"24 Dec 1854","Holy Trinity, Islington","Catherine","Yes",,,"16","April","1859",,
7,"07","Catherine","Casey","1","0","George Casey","Cathrine Casey","46","York Street",,"St Lukes",,"Watch maker",,"24 Dec 1854","Holy Trinity, Islington","Ellen","Yes",,,"16","April","1859",,
8,"08","Joseph","Long","0","11","Robert Long","Mary Ann Long","16","Brunswick St","Cromer St",,,"Painter","Book binder","13 Dec 1856","St Pancras in the parish of St Pancras","Elizabeth","No",,,"26","April","1859","Dead","Dead written after name"
9,"09","Emma","Borron","2","0","William Borrow","Emma Borrow","10","Drakes St","Red Lion Sq",,,"Hair preparer","Hair worker","15 April 1855","St Marys Lambeth","Louisa",,,,"4","May","1859",,
10,"10","Walter","Bristow","0","1","George Bristow","Sarah Bristow","3","Pye Ball Yard","Bloomsbury",,,"Japanner",,"11 June 1848","St Martins in the Field","George","No","None",,"7","May","1859","Dead","Dead written after name"
11,"11","Charles","Evans","2","0","Henry Evans","Ellen Evans","10","Drakes St","Red Lion Sq",,,"Tailor","Charwoman","30 Jan 1854","St Georges Bloomsbury","Henry, Ellen","Yes",,,"8","May","1859","Dead","Dead written after name"
12,"12","Jane","Jamieson","3","0","George Jamieson","Jane Jameison","Green Rents","Smithfield",,,,"Soap maker",,"4 Oct 1857","St Pancras in the parish of St Pancras",,"Yes",,"Mrs Tovey, 10 Sandwich Street","11","May","1859",,
13,"13","William","Davies","0","3","Edward Davies","Elizabeth Davies","6","Burton Street",,"High Holborn",,"Tailor",,"15 April 1855","St Giles Cripplegate in the City of London",,"No",,"Mrs Thomas  Ellis, 5 Fenwick St Holborn","17","May","1859",,
14,"14","Henry","Twiford","3","0","Thomas Twiford","Amelia Twiford",,"Acorn Head Lane",,"Islington",,"Painter",,"16 March 1857","St Pancras in the parish of St Pancras","Charles, Thomas","Yes",,,"18","May","1859",,
15,"15","Bernard John","Norton","0","2","Charles Norton",,"14","Wilson St","Grays Inn Road",,,"Tutor",,"26 Sep 1857","Registry Office, Islington",,"No","None","Mrs Corkerile,2 Hemming Pond Terrace Richmond Rd","18","May","1859",,
16,"16","Edward","Ireland","4","0","Samuel Ireland","Eliza Ireland","11","Harrison St","Grays Inn Road",,,"Grocer",,"27 Feb 1853","St Pancras in the parish of St Pancras","Eliza","Yes",,,,"June","1859",,
17,"17","Emma","Watson","0","11","Amos Watson","Priscillia Watson","25","Grays Inn Lane",,"Holborn",,"Whitesmith","Charwoman","25 Aug 1856","Trinity Church in the Parish of St Andrew Holborn","William","Yes",,"J.W. Clement, 45 Grays Inn Lane","14","June","1859",,
18,"18","Henry","Evans","4","0","Henry Evans","Ellen Evans","10","Drakes Street","Red Lion Sq",,,"Tailor","Charwoman","30 Jan 1854","St Georges Bloomsbury","Charles, Ellen","Yes",,,"20","June","1859",,
19,"19","William","Mathews","0","10","William Mathews","Margaret Mathews","8","New Milman St",,,,"Servant",,"25 November 1855","St Margaret Westminster","Samuel","Yes",,,"22","June","1859",,
20,"20","Samuel","Mathews","3","0","William Mathews","Margaret Mathews","8","New Milman St",,,,"Servant",,"25 November 1855","St Margaret Westminster","William","Yes",,,"22","June","1859",,
21,"21","Elizabeth Mary Ann","Wray","0","11","John Wray","Mary Ann Wray","11","Little Grays Inn Lane",,,,"Porter",,"8 January 1854","St Pancras Church in the Parish of St Pancras",,"Yes",,"Mrs Smith 11 Little Grays Inn Lane","28","June","1859","Second admission date 14 May 1862",
22,"22","Elizabeth","Long","3","0","Robert Long","Mary Ann Long","9","Hamstead Road",,,,"Painter",,"13 December 1852","St Pancras Church in the Parish of St Pancras",,"Yes",,,"4","July","1859",,
23,"23","Angelina","Nunn","1","4","Henry Nunn","Sarah Elizabeth Nunn","26","Gough Street","Grays Inn Road",,,"Ivory Turner","Washerwoman","16 October 1857","Parish Church of St Andrews Holborn London",,"Yes",,"Mrs Pullen 1 Guildford Street Grays Inn Road","6","July","1859",,
24,"24","William","Nisbet","1","4","William Nisbet","Elizth Nisbet","13","Bakers Road",,"Clerkenwell",,,"Laundress",,,,"Yes",,"Mrs Grace 13 Bakers Row Clerkenwell","7","July","1859",,
25,"25","Juila","Norton","3","6","Edward Norton","Eliza Norton","19","New North Street","Theobolds Rd",,,"Newsvendor",,"24 August 1852","St Pancras Church in the Parish of St Pancras","Sarah, Ann, Francis","Yes",,"Mrs Blythe 15 New North Street","18","July","1859",,
26,"26","William","Goodchild","0","4","John Goodchild","Pauline Goodchild","17","Wilmot St","Brunswick Sq",,,"Servant","Servant","12 Jan 1859","Register Offricer in the District of Brentford",,"Yes",,"Mrs Wray 17 Wilmot St Brunswick Sq","19","July","1859",,
27,"27","William","Willis","0","4","William Willis","Mary Ann Willis","5","Hanover Place","Oxford Street",,,"Soilder",,"17 April 1834","Parish Church of Bedminster in the Counties of Bristol",,"Yes",,,"27","July","1859","Probably soldier","Probably soldier"
28,"28","Emily","Garrett","1","0",,"Rebecca Garrett","6","Brickhill Place","Lambs Conduit St",,,,"Charwoman",,,,"Yes",,"Mrs Cole 6 Brickhill Place Lambs Conduit St","29","July","1859",,
29,"29","William","Trevallion","0","6","William Trevallion","Harriett Trevallion","7","Little Grays Inn Lane",,,,"Soilder",,"15 June 1856","Parish Church of Little Moorfields",,"Yes",,,"30","July","1859","Probably soldier","Probably soldier"
30,"30","Amy","Woodham","0","4","Charles Woodham","Rebecca Woodham","96","Harrison St","Grays Inn Lane",,,"Pianoforte maker",,"24 December 1851","All Souls Church in the Parish of St Marylebone","Annie","Yes",,,"30","July","1859",,
31,"31","George","Sweetland","0","4","William Sweetland","Jane Sweetland","10","Harrison St","Grays Inn Lane",,,"Machinest",,"28 August 1851","All Souls Church in the Parish of St Marylebone","William, Hurbert, Fanny","Yes",,,"1","August","1859","George Sweetland - dead",
32,"31","Elizabeth","Sweetland","1","8","William Sweetland","Jane Sweetland","10","Harrison St","Grays Inn Lane",,,"Machinest",,"28 August 1851","All Souls Church in the Parish of St Marylebone","William, Hurbert, Fanny","Yes",,,"14","August","1862","Elizabeth Sweetland  admitted",
33,"32","Mary","Evans","4","0","Daniel Evans Widower",,"21","Brunwick St","Judd St","New Road",,"Ladies Boot Maker",,,,"Elizabeth","Yes",,"Mrs Mahoney 21 Brunswich St Judd St New Road","15","August","1859",,
34,"33","Elizabeth","Evans","1","0","Daniel Evans Widower",,"21","Brunwick St","Judd St","New Road",,"Ladies Boot Maker",,,,"Mary","Yes",,"Mrs Mahoney 21 Brunswich St Judd St New Road","15","August","1859",,
35,"34","Henry","McDonnell","1","4","Henry McDonnell","Rachel McDonnell",,,,,,"Meat Salesman","Milliner","23 September 1855","St Pancras Church in the Parish of St Pancras","Elizabeth","Yes",,,"22","August","1859",,
36,"34","William","McDonnell","0","9","Henry McDonnell","Rachel McDonnell",,,,,,"Meat Salesman","Milliner","23 September 1855","St Pancras Church in the Parish of St Pancras","Elizabeth","Yes",,,"23","April","1863",,
37,"35","Robert W.","Everson","0","10","Everson","Everson","Cottage House","Hampden St",,"Somers Town",,"Sailor","Milliner",,,,"Yes",,"Mrs Howe Cottage House Hampden St  Somers Town","30","August","1859","Dead",
38,"36","Annie","Woodham","5","0","Charles Woodham","Rebecca Woodham","96","Harrison St","Grays Inn Lane",,,"Pianoforte maker",,"24 December","All Souls Church in the Parish of St Marlebone","Amy","Yes",,,"4","September","1859",,
39,"37","Emily","D'Alberg","0","2","William D'Alberg","Sophia D'Alberg","24","Strutton Ground",,"Westminster",,"Soldier",,"4 February 1857","St John's Church in the District of St John Waterton*",,"No","None",,"4","September","1859","Redmitted at 1yr 2mnths on 28 March 1962; Dead","Redmitted at 1yr 2mnths on 28 March 1962 Dead"
40,"38","William","Perry","2","0","Perry","Perry","6","Regent Place","Regent Square",,,"London City Missionary",,,,,"Yes",,,"5","September","1859",,
41,"39","Cornelius","Grove","0","1","Thomas Grove","Juila Grove","47","Gloucester St","Queens Sq",,,"Cook",,"22 February 1844","St Georges Bloomsbury",,"No",,,"6","September","1859","Dead","Age 5 weeks, * Possibly Juila"
42,"40","Alice","Cameron","2","6","Cameron","Cameron",,"Great Ormond Street",,,,"Surgeon",,,,,"Yes",,,"19","September","1859",,
43,"41","Louisa","Fullerton","0","3","Charles Fullerton","Mary Fullerton","29","Duke St","Lincolns Inn Fields",,,"Porter",,,,,"No",,"Sisters of Mercy 47 Great Ormond St","19","September","1859",,
44,"42","William","Donkin","1","5",,"Marion Elizabeth Donkin Widow","13","Wilstead St","New Road",,,,,"16 February 1836","St James Clerkenwell",,"Yes",,,"1","October","1859","Second Address recorded 2 Guildford Place Bagnage wells Road","Second Address recorded 2 Guildford Place Dagnagewells Road"
45,"43","Henry","Holmes","4","0",,"Harriet Holmes","28","Noble St",,"Clerkenwell",,,"at the Distillery 258 Holborn",,,"Annie, John","Yes",,"Mrs Blackwell, 28 Noble St, Clerkenwell","6","October","1859","Widow","Widow"
46,"45","Joseph","Lumby","6","0","Joseph Lumby","Jane Lumby","8","Bopnner Court","Queens Sq",,,"Butcher",,"20 May 1852","St Georges, Bloomsbury","Elizabeth","Yes",,,"15","October","1859",,
47,"46","Elizabeth Ann","Barnet","0","6","Mr Barnent","Mrs Barnet","Boys Home","Euston Road",,,,,,,,"Martha",,,"Miss Bell","25","October","1859",,
48,"47","Martha","Harrison","0","6","Henry John Harrison","Martha Harrison","44","Queens Sq",,,,"Stationer",,"25 May 1858","St Mary,Newington in the County of Surrey",,"No",,,"26","October","1859",,
49,"48","Topsy","Rowe","5","0","Frederick Rowe","Sarah Rowe","27","New North St",,,,"Dyer",,"28 May1850","Parish of St John  the Baptist, Hoxton","Sarah","Yes",,,"26","October","1859",,
50,"49","Sarah","Rowe","3","0","Frederick Rowe","Sarah Rowe","27","New North St",,,,"Dyer","envilope folder","28 May1850","Parish of St John  the Baptist, Hoxton","Topsy","Yes",,,"26","October","1859",,
51,"50","Henry","Strike","5","0",,"Emma Strike","19","Marchmont Place","Coram Street",,,,"Envilope folder",,,,"Yes",,"Mr Wilfred Sykes","31","October","1859",,
52,"51","George","Randall","0","4","George Randall","Debora Randall",,"Union Terrace","Leather Lane",,,"Porter",,"16 April 1855",,"Debora","Yes",,,"1","November","1859","Dead after name",
53,"52","Walter","Ford",,,"William Ford","Emily Ford","96","Harrison St","Grays Inn Road",,,"Draper",,"26 April 1850","St Pancras Church in the Parish of St Pancras",,"Yes",,,"3","November","1859",,
54,"53","John","Ling","0","0",,"Catherine John Ling","5","Hands Court",,"Holborn",,,"Charwoman",,,,,,"Mrs Gibb,4 Feathers Mews, Millmon St, Foundling","15","November","1859",,
55,"54","Edward","Lambert","3","0",,"Sarah Lambert","10","Brooks Market",,,,"Printer","at the Distillery 258 Holborn",,,"Jane",,,"Mrs Daire, 10 Brooks Market","21","November","1859","Dead",
56,"55","Jane","Lambert","1","6",,"Sarah Lambert","10","Brooks Market",,,,"Printer","at the Distillery 258 Holborn",,,"Edward",,,"Mrs Daire, 10 Brooks Market","21","November","1859",,
57,"56","Fredserick William","Jones","0","11",,"Sarah Jones Widow","6","Furnivals Inn Place","Holborn Hill",,,,"Charwoman","23 Aug 1842","St John, Westminister",,,,,"5","December","1859","Dead",
58,"57","Louisa","Bernard","0","2",,"Mrs Bernard","21","Chester Terrace","Regents Park",,,,"Nurse",,,,"No","Measles, chicken pox, hooping cough","Mrs Farrer, 21 Chester Terrace, Regents Park","30","November","1859",,
59,"58","Alise","Perry","0","3",,"Perry","16","Wellington Street","Grays Inn Road",,,"Sailor","Charwoman","4 July 1856",,,"Yes",,,"8","December","1859","Dead after name",
60,"59","Elizbeth","Roberts","6","0","William Roberts","Maria Roberts","3","Cottage Place","Brunswick Sq",,,"Labourer","Charwoman",,,"Frederick, Charlott, Harriett, Thomas","Yes",,,"12","December","1859",,
61,"60","Frederick","Roberts","1","7","William Roberts","Maria Roberts","3","Cottage Place","Brunswick Sq",,,"Labourer","Charwoman",,,"Eliz'th, Charlotte, Harriette, Frederick","Yes",,"Ly*","12","December","1859",,
62,"61","George","Joyce","2","0","John Joyce","Mary Joyce","4","Cottage Place","Brunswick Sq",,,"Printer","Charwoman",,,"John, Maria, Eliz'th, Joseph","Yes",,"Mrs Coxhead, 6 mecklenburgh Sq","16","December","1859",,
63,"62","Charles","Minet","0","8","M*** Henry Minet",,"21","Red lion Street",,"Holborn",,"Clerk",,,,"Henry","Yes",,"Mrs Sharzes, 4 Gladstone Terrace, Camberwell Gate","19","December","1859",,
64,"63","Valintien","Orlowski","3","5",,,"50","Goode Street","New Road",,,,,,,,"Yes",,"Mr Heisig, London City Missionary to Foreigners","19","December","1859",,
65,"64","James Ambrose","Coleman","1","1","Ambrose Coleman","Sarah Coleman","99","Cromer Street","Grays Inn Road",,,"Draper",,"26 July 1857","St Martins in the Fields",,"Yes",,,"19","December","1859",,
66,"65","Richard","Ellard","0","9","William Ellard","Sarah Ellard",,"Rugby Yard","Lambs Conduit Street",,,"Labourer",,"4 July 1858","Christ Church, Marylebone",,"Yes",,,"27","December","1859",,
67,"66","Henry","Minit","4","0","Mr Mrs Henry Minit",,"21","Red Lion Street",,,,"Clerk",,,,"Charles","Yes",,,"29","December","1859",,
68,"67","George","Gibbons","0","5","George Gibbons","Martha Ann Gibbons","3","Gloucester St",,,,"Watchmaker","Charwoman","12 Dec'er 1858","St George the Martyr",,"Yes",,,"7","Jan'y","1860",,
69,"68","Charlotte","Roberts","3","0","William Marion Roberts",,"3","Cottage Place",,"Brunswick Square",,,"Charwoman",,,"Eliz'th, Harriett, Frederick","Yes",,,"14","Jan'y","1860",,
70,"69","Thomas","Joyce","0","1","John Joyce","Mary Joyce","4","Cottage Place",,"Bermondsey",,"Printer","Charwoman",,,"John, Marion, Eliz'th, Joseph","No",,"Mrs  Coxhesd ,6 Mecklenburgh Sq","16","Jan'y","1860",,
71,"70","Emily","Hills","3","0","Edwin Hills","Eliza  Hills","34","Gloucester St","Queens Square",,,"Printer","Parasol Maker","27 Sept'er 1857","Parish of St Leonards, Shoreditch",,"Yes",,,"16","Jan'y","1860",,
72,"71","George","Denny","3","0","Thomas Denny","Johannah Denny","8","Cottage Place",,"Brunswick Square",,"Costermonger","Costermonger","21 Aug'st 1836","St Andrew, Holborn",,"Yes",,,"17","Jan'y","1860",,
73,"72","James","Dumply","0","2","William Dumply","Sarah Dumply","13","Brunswick  St","Cromer St",,,"Carman","Charwoman",,,"Emma, William, George","No",,"Mrs Luster,21 Queens Square","21","Jan'y","1860","Dead",
74,"73","Samuel","Kippest","1","0","Samuel Kippest","Sarah Kippest",,,,,,"Printer","Charwoman","26 Oct'er 1858","St Annes Westminster",,"Yes",,,"23","Jan'y","1860","Dead",
75,"74","Harry","Everett","4","0","Henry Everett","M*h* Everett","3","Gloucester Street","Anne Sq",,,"Bookbinder",,,,"Mary Ann","Yes",,"Mrs Hills, 3 Gloucester St Queens  Sq","21","Jan'y","1860",,
76,"75","Samuel","Honell","0","11","Charles Honell","Eliza Honell","8","Cottage Place","Brunswick Sq",,,"Carpenter",,"5 April 1858","All Souls Church in the Parish of St Marylebone",,,,,"24","Jan'y","1860",,
77,"76","Harry","McCullum","4","0","George McCullum","Eliz'th","1","Everet Street","Russel SQ",,,"Brass Founder",,"12 Aug 1855","All Souls Church in the parish of St Marylebone","Frederick",,,,"31","Jan'y","1860","Address at bottom of page 5 Dalton St, Clerkenwell*",
78,"77","Mary Ann","Smith","4","0","Thomas Smith Widower",,,,,,,,,,,"Charles","Yes",,"Mrs Benbo, Russel Sq","10","Feby","1860",,
79,"78","Charles","Smith","2","0","Thomas Smith Widower",,,,,,,,,,,"Mary Ann","Yes",,"Mrs Benbo, Russel Sq","10","Feby","1860",,
80,"79","Emma","Blow","0","1","George Blow","Ann Blow","42","Fetter Lane",,,,"Printer","Charwoman","6 April 1854","Leonards, Shoreditch",,"No","None",,"13","Feby","1860",,
81,"80","Ada","Baxter","1","0","Henry Baxter","Caroline Baxter","45","Upper Rosomond St",,,,"Cabinet Maker",,"6 July 1852","St Andrews, Holborn","Carry","Yes",,,"14","Feby","1860",,
82,"81","Frederick","Brooks","0","11","Frederick Brooks","Mary Ann Brooks","3","Dean St",,"Holborn","High Holborn","Porter",,"31 June 1858","Parish of St Giles Cripplegate",,"Yes",,,"28","Feby","1860",,
83,"82","Eliz'th","Young","2","0",,,"8","Percy St",,"Somers Town",,"Coach Builder",,"1 Dec 1857","at the Register Office in the District of Saint Pancras",,"Yes",,,"4","March","1860",,
84,"83","George","Foster","2","0","Christopher Foster","Eliza Foster","15","Mount Pleasant",,"Clerkenwell",,"Engineer",,"7 April 1857","St Mary's Lambeth",,"Yes",,,"20","March","1860",,
85,"84","Eliz'th","Parr","3","0","Mr Parr","Mrs Parr","5","Devon St",,"Holborn",,,,,,,"No",,,"30","March","1860",,
86,"85","Charlotte","Hancock","0","4","James Hancock","Charlotte Hancock","18","Little Ormond Yard",,,,"Grocer",,"18 August 1847*","In the Parish Church of St Dunstan West",,"No",,,"12","April","1860",,
87,"86","Aldworth","Everson","0","2",,"Elizth Emerson","3","Little Ormond St",,,,,,,,,"No",,,"12","April","1860",,
88,"87","Ann","Coote","1","4","Thomas Coote","Mary Coote","23","Warner St",,"Clerkenwell",,"Servant","Charwoman","15 May 1850","at the parish church of Northfleet Thanet",,"yes",,,"14","April","1862",,
89,"87","Elizabeth Brown","Coote","6","0","Thomas Coote","Mary Coote","23","Warner St",,"Clerkenwell",,"Servant","Charwoman","15 May 1850","at the parish church of Northfleet Thanet",,"yes",,,"14","April","1862",,
90,"88","Herbert","Hinton","3","6","Robert Hinton","M. A. Hinton","3","Great New Street","Fetter Lane",,,"Carpenter",,"13 March 1853","St James in the parish of St Leonard Shoreditch","Arthur",,,,"30","April","1860",,
91,"89","Alfred","Hinton","0","10","Robert Hinton","M. A. Hinton","3","Great New Street","Fetter Lane",,,"Carpenter",,"13 March 1853","St James in the parish of St Leonard Shoreditch","Robert",,,,"30","April","1860","2nd address: 9 Kirby St  Haatton Garden.  2nd admission  September 30 1862","2nd address: 9 Kirby St  Haatton Garden.  2nd admission  September 30 1862"
92,"90","William","Gwillam","3","6","William Gwillam","Eliza Gwillam","49","Gloucester St","Queen Square",,,"Tailor",,"7 November 1852","Christ Church in the county of Middlesex","Sarah","yes",,,"7","May","1860",,
93,"91","Sarah","Gwillam","2","0","William Gwillam","Eliza Gwillam","49","Gloucester St","Queen Square",,,"Tailor",,"7 November 1852","Christ Church in the county of Middlesex","William","yes",,,"7","May","1860",,
94,"92","Caroline","Tobin","2","0","Edward Tobin","Elizth Tobin","3","Green Street","Theobalds Road",,,"Labourer",,"23 August 1857","St Johns Church in the parish of St Johns Waterloo",,"yes",,,"8","May","1860",,
95,"93","William","Scott","1","2","Andrew Scott","Christiana Scott","94","Theobalds Road",,,,"Baker",,"5 July 1857","St Pancras Church in the parish of St Pancras",,"yes",,,"16","May","1860",,
96,"94","Henry","Davis","0","9","Henry Davis","Olive Davis","3","Green Street","Theobalds Road",,,"Warehouse Man",,"17 July 1853","St Andrews Church Holborn",,"yes",,,"24","May","1860",,
97,"95","William","Mark",,,"Henry Mark","Jane Mark","8","Frederick Street","Grays Inn Road",,,"Messenger",,"20 July 1853","St Pancras Church in the parish of St Pancras","Charles","yes",,,"24","March","1860",,
98,"96","Charles","Mark",,,"Henry Mark","Jane Mark","8","Frederick Street","Grays Inn Road",,,"Messenger",,"20 July 1853","St Pancras Church in the parish of St Pancras","William","yes",,,"24","
ay","1860",,
99,"97","William","Logie","0","7","William Logie","Frances Logie","7","Powis Place","Queen Square",,,"Carpenter",,"10 August 1855","St Georges Hanover Square","Mary and Frances","yes","None","Mrs Comber Powis Place 11","26","May","1860",,
100,"98","Charles","McCarthy","0","5","Stephen McCarthy","Ellen McCarthy","40","Devonshire St","Queen Square",,,"Compositor",,"13 August 1854","St Georges Cathedral  Southwark","Mary, Ann and George","yes","None","Mrs Evans 29 Devonshire St Queen Square","30","May","1860",,
101,"99","Henry","Hooton","0","11","James Hooton","Mary Hooton","14","Red Lion Passage","Red Lion Square",,,"Cabinet Maker",,"13 June 1858","St Marys Haggerston",,"yes","Measles","Mrs Gwillam","31","May","1860",,
102,"100","Henry","Willy","0","11","Henry Willy","Susan Willy","6","Green St","Theobalds Rd",,,"Cabinet Maker",,"20 June 1859","Trinity Church, St Andrews Holborn",,"yes",,,"5","June","1860",,
103,"101","Elizabeth","Clark","1","10","George Clark","Harriet Clark","36","Catton St","Clerkenwell",,,"Porter",,"3 December 1853","Register Office Strand",,"yes",,,"5","June","1860",,
104,"102","Caroline","Baxter","4","0","Henry Baxter","Caroline Baxter","7","Hambelton Row","Redmond St",,,"Cabinet Maker",,"6 July 1852","St Andrew Holborn","Ada","yes",,,"5","June","1860",,
105,"103","Sarah","Norton","5","0","Edward Norton","Ann Norton","19","New North St","Theobalds Road",,,"Newsvender",,"24 August /52","St Pancras","Sarah, Francis and Julia","yes",,,"15","June","1860",,
106,"104","Lewis","Libassio","0","10",,"Mary Libassio","10","Little Coram St",,,,,"Widow",,,,"yes",,"Captain Wood","18","June","1860",,
107,"105","James","Keating","3","6","James Keating","Emma Keating","16","Gough St","Grays Inn Road",,,"Carver and Gilder",,"11 May 1856","Parish Church, St Giles Cripplegate","Frank","yes",,"Mrs D Alberg","18","June","1860",,
108,"106","Frank","Keating","1","3","James Keating","Emma Keating","16","Gough St","Grays Inn Road",,,"Carver and Gilder",,"11 May 1856","Parish Church, St Giles Cripplegate","James","yes",,"Mrs D Alberg","18","June","1860",,
116,"107","Emily","Sibley","0","6",,"Marie Sibley","32","Stanhope St",,,,,"Dress Maker",,,,"yes","None","Miss Ridley","2","July","1860","Dead",
117,"108","Frances","Logie","3","0","William Logie","Harriet Logie","7","Powis Place","Queens Sq",,,"Carpenter",,"18 August 1855","St Georges Hanover Sq","Mary, William","yes",,"Mrs Comber 11 Powis Place","2","July","1860",,
118,"109","Alice","Wheatly","3","5","Richard Wheatly","Amelia Wheatly","No 1","Field St","243 Pentonville Rd",,,"Skylight Maker",,"22 January 1843","Parish Church of St Marylebone Middlesex","Edward","yes",,,"3","July","1860",,
119,"110","Edward","Wheatly","0","5","Richard Wheatly","Amelia Wheatly","No 1","Field St","243 Pentonville Rd",,,"Skylight Maker",,"22 January 1843","Parish Church of St Marylebone Middlesex","Alice","yes",,,"3","July","1860",,
120,"111","Henry","Lustead","0","5","Thomas Lustead","Ann Lusted",,"Doughty Mews",,,,"Groom","Charwoman","19 September 1852","St Johns Waterloo","Charles, Thomas","yes","Measles",,"10","July","1860","Foundling; Dead",